{"text_format":"1","workbook":"xlsx","n_sheets":3,"sheets":["Unterzug","SES Richtlinien","Daten 1"],"not_rendered":{"charts":1,"images":4,"macros":1,"external_links":3,"defined_names":7,"comments":0,"pivot_tables":0},"unopened":[],"bounds":{"document_bytes":16777216,"sheet_cells":100000,"rows_first":2000,"rows_last":500,"rows_between":2000,"halvings":0,"cell_chars":16384,"cell_head_chars":4096},"cells_cut":0,"cells_raw":0,"read":"whole","date_system":"1900"}

{"sheet":"Unterzug","index":0,"n_rows":44,"n_cols":18,"rows_kept":44,"cut":false,"hidden":false,"merged":[[43,5,45,13],[40,15,40,17],[10,15,19,17],[26,15,33,17],[0,0,1,3],[13,0,13,1],[19,0,19,1],[3,11,3,14],[4,11,4,14]]}
["Unterzug Berechnung für Brandmelder"]
[null,null,null,null,null,null,null,null,null,null,null,"Gebäude, Stockwerk, Raum:"]
[]
["Anlage: ","Anlage Name1",null,"Adresse: ","Adress3",null,null,null,null,null,null,"Geb.7"]
["Anlage Nr.","Anlage Nr.2",null,"PLZ / Ort:","PLZ / Ort4",null,null,null,null,null,null,"1.OG / Raumtext 8"]
[]
[null,null,null,null,null,null,null,null,null,null,null,null,null,null,null,"Raumhöhe:",0,"m"]
[null,null,null,null,null,null,null,null,null,null,null,null,null,null,null,"Unterzugshöhe:",0,"m"]
[]
[null,null,null,null,null,null,null,null,null,null,null,null,null,null,null,{"$f":"'Daten 1'!B3","v":"Bereich A"}]
[null,null,null,null,null,null,null,null,null,null,null,null,null,null,null,{"$f":"IF(ISERROR(VLOOKUP(P10,'Daten 1'!B25:C27,2,FALSE)),\"\",VLOOKUP(P10,'Daten 1'!B25:C27,2,FALSE))","v":"Die im Bereich A liegenden Unterzüge haben keinen Einfluss auf die Anordnung der Rauchmelder."}]
[]
[]
[]
[]
[]
[null,null,null,null,null,null,"6"]
[]
[]
[]
[]
[]
[null,null,null,null,null,null,null,null,null,null,null,null,null,null,null,{"$f":"IF(P10=\"Bereich B\",\"Bereich B\",\"\")","v":""}]
[null,null,null,null,null,null,null,null,null,null,null,null,null,null,null,{"$f":"IF(P10=\"Bereich B\",\"Anordnung der Rauchmelder\",\"\")","v":""}]
[null,null,null,null,null,null,null,null,null,null,null,null,null,null,null,{"$f":"IF(P10=\"Bereich B\",\"Eingabe in %:\",\" \")","v":" "},0.8]
[]
[null,null,null,null,null,null,null,null,null,null,null,null,null,null,null,{"$f":"IF(P10=\"Bereich B\",IF(Q25>120%,'Daten 1'!D32,IF(Q25<80%,'Daten 1'!D34,'Daten 1'!D33)),\" \")","v":" "}]
[]
[]
[]
[]
[]
[]
[]
[]
[]
[null,null,null,null,null,null,null,null,null,null,null,null,null,null,null,"Abstand zu Decken (SES 7.4)"]
[]
[null,null,null,null,null,null,null,null,null,null,null,null,null,null,null,"Raumhöhe Rh beim Melderstandort:",null,{"$f":"Q7","v":0}]
[null,null,null,null,null,null,null,null,null,null,null,null,null,null,null,"Neigung in α: Grad °:",null,0]
[null,null,null,null,null,null,null,null,null,null,null,null,null,null,null,{"$f":"IF(R40<30,IF(R39<3,'Daten 1'!Q4,IF(Unterzug!R39<6,'Daten 1'!Q5,IF(R39<7.5,'Daten 1'!Q6,IF(R39<9,'Daten 1'!Q7,IF(R39>=9,'Daten 1'!Q8,))))),IF(R39<3,'Daten 1'!R4,IF(R39<6,'Daten 1'!R5,IF(R39<7.5,'Daten 1'!R6,IF(R39<9,'Daten 1'!R7,IF(R39>=9,'Daten 1'!R8,\"\"))))))","v":"3 bis 20 cm"}]
[]
[null,"Vorname / Name:",null,"VKF Nr.:",null,"Unterschrift:"]
[null,"Vorname Name5",null,"123456896"]

{"sheet":"SES Richtlinien","index":1,"n_rows":61,"n_cols":7,"rows_kept":61,"cut":false,"hidden":false,"merged":[[0,1,0,2],[25,1,25,9],[60,1,60,8],[33,1,39,9],[44,1,44,8],[46,1,50,8],[59,1,59,2],[59,3,59,5],[59,6,59,8],[2,1,3,9],[4,1,5,9],[57,1,57,2],[57,3,57,5],[57,6,57,8],[58,1,58,2],[58,3,58,5],[58,6,58,8],[55,1,55,2],[55,3,55,5],[55,6,55,8],[56,1,56,2],[56,3,56,5],[56,6,56,8],[23,1,24,9],[27,1,31,9],[52,1,54,2],[52,3,52,8],[53,3,54,5],[53,6,54,8],[7,1,8,3],[7,4,8,9],[10,4,10,9],[11,4,11,9],[12,1,22,1],[12,2,22,2],[12,3,22,3],[12,4,15,9],[16,4,22,9]]}
["7.8.2","Rauchmelder  "]
[]
[1,"Die im Bereich A (Tabelle Unterzug) liegenden Unterzüge haben keinen Einfluss auf die Anordnung der Rauchmelder."]
[]
[2,"Die im Bereich B (Tabelle Unterzug) liegenden Unterzüge beeinflussen die Anordnung von Rauchmeldern gemäss nachstehender Tabelle: "]
[]
[]
[null,"Grösse des Deckenfeldes \nin % von Amax",null,null,"Anordnung der Rauchmelder "]
[]
[null,"60m²",null,"80m²"]
[null,"> 72m²","über 120%","> 96m²","Entsprechende Anzahl an Decke in Deckenfeld 1) 2)"]
[null,"48-72m²","80 bis 120 %","64-96m²","Ein Rauchmelder an Decke in jedes Deckenfeld sofern der Melderabstand zur Wand a/2 und b/2 120% nicht überschreiten. 2)"]
[null,"< 48m²","unter 80%","< 64m²","Auf dem Unterzug oder im Deckenfeld so, dass der Melder Oberkant maximal 10 cm von Unterkant des Unterzugs entfernt ist.1) "]
[]
[]
[]
[]
[]
[]
[]
[]
[]
[]
[null,"Seitliche Abstände zu Wänden und Einrichtungen sind gemäss 7.3 einzuhalten. \n1) Amax und die Melderabstände a und b gemäss Tabelle 1 sind einzuhalten.  \n2) Abstand Dv  zur Decke gem. Tabelle 2 einhalten "]
[]
[null,"Tabelle 3 Anordnung von Rauchmeldern im Bereich B"]
[]
[3,"Die im Bereich C (Tabelle Unterzug) liegenden Unterzüge gelten grundsätzlich als Raumabtrennung. Die Rauchmelder sind an der Decke im Deckenfeld anzuordnen. Besteht zwischen den Unterzügen ein Abstand bis \n3 m, ist die Regelung für die Anordnung der Melder in Korridoren anzuwenden."]
[]
[]
[]
[]
[]
[4,"Besteht bei Unterzügen in den Bereichen B und C (Tabelle Unterzug) ein Abstand Dh. grösser als 20 cm zwischen Oberkante Unterzug und Unterkante Dach oder Decke (Abbildung 5) und ist bei diesem Abstand die freie Fläche der Öffnung grösser als 75% der Gesamtfläche (nach Abzug aller Einbauquerschnitte wie Kanäle usw.), brauchen Unterzüge unterhalb, gleich welcher Höhe, nicht berücksichtigt zu werden. "]
[]
[]
[]
[]
[]
[]
[]
[]
[7.4,"Abstand zu Decken"]
[]
[1,"Wärmemelder sind direkt an der Decke anzubringen."]
[]
[2,"Bei Punkt-Rauchmeldern oder Ansauglöchern von Ansaugrauchmeldern ergeben sich die erforderlichen vertikalen Abstände (Dv) des rauchempfindlichen Elements zur Decke aus deren Neigung und Raumhöhe beim Melderstandort (Rh) der zu berwachenden Räume. Die Werte für die Abstände gehen aus der nachstehenden Tabelle 2 und deren Anordnung aus Abbildung 2 hervor. "]
[]
[]
[]
[]
[]
[null,"Raumhöhe Rh beim \nMelderstandort ",null,"Abstand Dv  "]
[null,null,null,"Neigung  \n0 bis 58 cm/m \n(α: 0 bis 30°) ",null,null,"Neigung über \n58 cm/m \n(α über 30°)"]
[]
[null,"bis 3 m",null,"3 bis 20 cm",null,null,"10 bis 30 cm"]
[null,"3m bis 6 m",null,"3 bis 30 cm",null,null,"20 bis 50 cm"]
[null,"6m bis 7.5 m",null,"7 bis 40 cm",null,null,"25 bis 60 cm"]
[null,"7.5m bis 9 m",null,"10 bis 50 cm",null,null,"30 bis 70 cm"]
[null,"> 9 m",null,"20 bis 100 cm",null,null,"50 bis 150 cm"]
[null,"Tabelle 2 Abstand Dv von Rauchmeldern zu Decken "]

{"sheet":"Daten 1","index":2,"n_rows":49,"n_cols":18,"rows_kept":49,"cut":false,"hidden":true,"merged":[[42,5,43,7],[44,0,44,1],[44,2,44,4],[44,5,44,7],[1,16,1,17],[47,0,47,1],[47,2,47,4],[47,5,47,7],[48,0,48,1],[48,2,48,4],[48,5,48,7],[45,0,45,1],[45,2,45,4],[45,5,45,7],[46,0,46,1],[46,2,46,4],[46,5,46,7],[41,0,43,1],[41,2,41,7],[42,2,43,4]]}
["Höhe",{"$f":"Unterzug!Q7","v":0}]
["Unterzug",{"$f":"Unterzug!Q8","v":0},null,null,null,null,null,null,null,null,null,null,null,null,null,null,"Abstand Dv  "]
["Sektor",{"$f":"\"Bereich \"&IF(B2<=0.2,\"A\",IF(B1<=(K17*B2+L17),\"C\",IF(B1<=(K9*B2+L9),\"B\",\"A\")))","v":"Bereich A"},null,null,null,null,null,null,null,null,null,null,null,null,null,"Raumhöhe Rh beim \nMelderstandort ",30,30.1]
[null,null,null,null,null,null,null,null,null,null,null,null,null,null,null,"<2.99","3 bis 20 cm","10 bis 30 cm"]
[null,null,null,null,null,null,null,null,null,null,null,null,null,null,null,"3 - 5.99","3 bis 30 cm","20 bis 50 cm"]
[null,null,null,null,null,null,null,null,null,null,null,null,null,null,null,"6 - 7.49","7 bis 40 cm","25 bis 60 cm"]
[null,null,null,null,null,null,null,null,null,null,null,null,null,null,null,"7.5 - 8.99","10 bis 50 cm","30 bis 70 cm"]
["Bereich A zu B",null,null,null,null,null,null,null,null,null,"m","b",null,null,null,">9","20 bis 100 cm","50 bis 150 cm"]
["y",0,2,6,12.5,18,20,null,null,null,{"$f":"LINEST(D9:G9,D10:G10,,TRUE)","v":21.633663366336634},1.685643564356436]
["x",0.2,0.2,0.2,0.5,0.75,0.85,null,null,null,0.1641893460571982,0.10302799697162097]
[null,null,null,null,null,null,null,null,null,null,0.99988481132618823,8.2504125309400878E-2]
["Formel:","y=mx+b",{"$f":"K9*B2+L9","v":1.685643564356436},null,null,null,null,null,null,null,17360.818181818144,2]
[null,null,null,null,null,null,null,null,null,null,118.17388613861387,1.3613861386138643E-2]
[]
[]
["Bereich B zu C",null,null,null,null,null,null,null,null,null,"m","b"]
["y",2,2.5,3,4,5,6,10,14.5,null,{"$f":"LINEST(B17:E17,B18:E18,,TRUE)","v":4.4409377817853928},1.1208295761947697]
["x",0.2,0.31,0.42,0.65,0.87,1.1000000000000001,2,3,null,3.9045329295962446E-2,1.6737198382459021E-2]
[null,null,null,null,null,null,null,null,null,null,0.9998454205848254,1.3002739532389429E-2]
["Formel:","y=mx+b",{"$f":"K17*B10+L17","v":2.0090171325518482},null,null,null,null,null,null,null,12936.333333333083,2]
[null,null,null,null,null,null,null,null,null,null,2.1871618575293055,3.3814247069432574E-4]
[]
[]
[]
[null,"Bereich A","Die im Bereich A liegenden Unterzüge haben keinen Einfluss auf die Anordnung der Rauchmelder."]
[null,"Bereich B","Die im Bereich B (Abbildung 4) liegenden Unterzüge beeinflussen die Anordnung von \nRauchmeldern gemäss nachstehender Tabelle:"]
[null,"Bereich C","Die im Bereich C liegenden Unterzüge gelten grundsätzlich als Raumabtrennung. Die Rauchmelder sind an der Decke im Deckenfeld anzuordnen. Besteht zwischen den Unterzügen ein Abstand bis 3 m, ist die Regelung für die Anordnung der Melder in Korridoren anzuwenden. "]
[]
[]
[null,"Grösse des Deckenfeldes"]
[60,"in % von Amax","80 m²","Anordnung der Rauchmelder "]
["> 72 m²",">120 %","> 96  m²","Entsprechende Anzahl an Decke in Deckenfeld. Seitliche Abstände zu Wänden und Einrichtungen sind gemäss SES 7.3 einzuhalten. \n\n1) Amax und die Melderabstände a und b gemäss SES 7.2 einzuhalten.\n\n2) Abstand Dv  zur Decke gem. SES 7.4 einzuhalten."]
["48 m²- 72 m²","80 - 120 %","64  m² - 96  m²","Ein Rauchmelder an Decke in jedes Deckenfeld sofern der Melderabstand zur Wand a/2 und b/2 120% nicht überschreiten. \n\n2) Abstand Dv  zur Decke gem. SES 7.4 einzuhalten."]
["< 48 m²","<80 %","< 64 m²","Auf dem Unterzug oder im Deckenfeld so, dass der Melder Oberkant maximal 10 cm von Unterkant des Unterzugs entfernt ist. \n\n1) Amax und die Melderabstände a und b gemäss SES 7.2 einzuhalten."]
[]
[]
[]
[]
[]
[]
[]
["Raumhöhe Rh beim \nMelderstandort ",null,"Abstand Dv  "]
[null,null,30,null,null,30.1]
[]
["<2.99",null,"3 bis 20 cm",null,null,"10 bis 30 cm"]
["3 - 5.99",null,"3 bis 30 cm",null,null,"20 bis 50 cm"]
["6 - 7.49",null,"7 bis 40 cm",null,null,"25 bis 60 cm"]
["7.5 - 8.99",null,"10 bis 50 cm",null,null,"30 bis 70 cm"]
[">9",null,"20 bis 100 cm",null,null,"50 bis 150 cm"]